{"text_format":"1","workbook":"xlsx","n_sheets":9,"sheets":["Feuil1","Feuil2","Feuil3","Feuil4","دخـــــــــــول","Feuil6","Feuil7","Feuil8","Feuil9"],"not_rendered":{"charts":0,"images":10,"macros":1,"external_links":0,"defined_names":4,"comments":0,"pivot_tables":0},"unopened":[],"bounds":{"document_bytes":16777216,"sheet_cells":100000,"rows_first":2000,"rows_last":500,"rows_between":2000,"halvings":0,"cell_chars":16384,"cell_head_chars":4096},"cells_cut":0,"cells_raw":0,"read":"whole","date_system":"1900"}

{"sheet":"Feuil1","index":0,"n_rows":38,"n_cols":8,"rows_kept":38,"cut":false,"hidden":false,"merged":[[33,4,33,6],[33,0,33,2],[31,5,31,6],[21,1,21,2],[22,1,22,2],[23,1,23,2],[24,1,24,2],[25,1,25,2],[26,1,26,2],[27,1,27,2],[28,1,28,2],[29,1,29,2],[30,1,30,2],[31,1,31,2],[26,5,26,6],[27,5,27,6],[21,5,21,6],[22,5,22,6],[23,5,23,6],[24,5,24,6],[25,5,25,6],[0,0,0,6],[6,5,6,6],[7,5,7,6],[8,5,8,6],[6,1,6,2],[7,1,7,2],[4,0,4,6],[5,3,5,6],[5,0,5,2],[5,10,5,13],[1,0,1,6],[2,0,2,6],[3,0,3,6],[15,5,15,6],[10,5,10,6],[10,1,10,3],[12,5,12,6],[13,5,13,6],[14,5,14,6],[12,1,12,2],[13,1,13,2],[14,1,14,2],[15,1,15,2],[9,5,9,6],[9,1,9,2],[35,5,35,6],[36,5,36,6],[37,1,37,2],[16,5,16,6],[17,5,17,6],[18,5,18,6],[19,5,19,6],[20,5,20,6],[17,1,17,2],[18,1,18,2],[19,1,19,2],[20,1,20,2],[16,1,16,2],[28,5,28,6],[29,5,29,6],[30,5,30,6]]}
["الجمهورية الجزائرية الديمقراطية الشعبية"]
[{"$f":"Feuil2!J2","v":"وزارة التربية الوطنية "}]
[{"$f":"Feuil2!H2","v":"مديرية التربية "}]
[{"$f":"Feuil2!G2","v":"مديرية التربية "}]
["كشف الراتب لشهر:"]
[{"$f":"VLOOKUP(A10,Feuil4!J2:AM200,30,FALSE)","v":2014},null,null,{"$f":"VLOOKUP(A10,Feuil4!J2:AL200,29,FALSE)","v":"فيفري"}]
[{"$f":"VLOOKUP(A10,Feuil4!B2:H200,7,FALSE)","v":"أعزب"},"الحالة العائلية",null,null,{"$f":"VLOOKUP(A10,Feuil4!B2:C200,2,FALSE)","v":"شريف"},"الاســـــــــــــــــم"]
[{"$f":"VLOOKUP(A10,Feuil4!B2:I200,8,FALSE)","v":12},"الدرجـــــــــة",null,null,{"$f":"VLOOKUP(A10,Feuil4!B2:D200,3,FALSE)","v":"عرابة"},"اللقــــــــــــــــــب"]
{"$rows_left_out":31}
{"sheet":"Feuil2","index":1,"n_rows":33,"n_cols":10,"rows_kept":33,"cut":false,"hidden":false,"merged":[]}
["الرقم","المنحة",null,"الرقم ","الاقتطاع",null,"المؤسسة","الجهة الوصية","المقتصد","الوزارة"]
[1,"ujujuj",null,1,"yynynynyn",null,"مديرية التربية ","مديرية التربية ","عرابة شريف","وزارة التربية الوطنية "]
[2,"uj-uju-j",null,2,"nununu"]
[3,"-jrtgth",null,3]
[4]
[]
[]
[]
{"$rows_left_out":26}
{"sheet":"Feuil3","index":2,"n_rows":12,"n_cols":11,"rows_kept":12,"cut":false,"hidden":false,"merged":[]}
["الرقم","الاسم","اللقب","الصنف","الاطار","القسم","الحالة العائلية","الدرجة","رقم الحساب"]
[1,"شريف","عرابة",13,"طب",14,"أعزب",12,1020]
[2,"خالد","اقتلقل",6,"لاىتات",2,"متزوج",12,1000]
[3,"تجريب","البرنامج",12,"استاذ",12,"متزوج",2,1230]
[4]
[]
[]
[]
{"$rows_left_out":5}
{"sheet":"Feuil4","index":3,"n_rows":211,"n_cols":66,"rows_kept":211,"cut":false,"hidden":false,"merged":[]}
["الرقم","رقم الحساب",{"$f":"Feuil3!B1","v":"الاسم"},{"$f":"Feuil3!C1","v":"اللقب"},{"$f":"Feuil3!D1","v":"الصنف"},{"$f":"Feuil3!E1","v":"الاطار"},{"$f":"Feuil3!F1","v":"القسم"},{"$f":"Feuil3!G1","v":"الحالة العائلية"},{"$f":"Feuil3!H1","v":"الدرجة"},{"$f":"Feuil3!I1","v":"رقم الحساب"},20100,1500,2000,{"$f":"Feuil2!B5","v":0},{"$f":"Feuil2!B6","v":0},{"$f":"Feuil2!B7","v":0},{"$f":"Feuil2!B8","v":0},{"$f":"Feuil2!B9","v":0},{"$f":"Feuil2!B10","v":0},{"$f":"Feuil2!B11","v":0},{"$f":"Feuil2!B12","v":0},{"$f":"Feuil2!B13","v":0},{"$f":"Feuil2!B14","v":0},{"$f":"Feuil2!B15","v":0},{"$f":"Feuil2!B16","v":0},{"$f":"Feuil2!B17","v":0},{"$f":"Feuil2!B18","v":0},{"$f":"Feuil2!B19","v":0},1500,350,{"$f":"Feuil2!E4","v":0},{"$f":"Feuil2!E5","v":0},{"$f":"Feuil2!E6","v":0},{"$f":"Feuil2!E7","v":0},{"$f":"Feuil2!E8","v":0},{"$f":"Feuil2!E9","v":0},{"$f":"Feuil2!E10","v":0},"اكتوبر",2013,"27/10/2013","رقم الموظف المدخل","val_resul","val_cher","Max"]
[{"$f":"Feuil3!A2","v":1},{"$f":"Tableau1[[#This Row],[رقم الحساب]]","v":1020},{"$f":"Feuil3!B2","v":"شريف"},{"$f":"Feuil3!C2","v":"عرابة"},{"$f":"Feuil3!D2","v":13},{"$f":"Feuil3!E2","v":"طب"},{"$f":"Feuil3!F2","v":14},{"$f":"Feuil3!G2","v":"أعزب"},{"$f":"Feuil3!H2","v":12},{"$f":"Feuil3!I2","v":1020},12000,20000,25000,null,null,null,null,null,null,null,30000,40000,30000,30000,null,null,null,null,1000,2000,null,null,null,null,null,null,null,"فيفري",2014,"2013-01-11",{"$f":"A2","v":1},{"$f":"VLOOKUP(AQ2,Feuil4!J2:AO200,32,FALSE)","v":4},null,{"$f":"MAX(A2:A210)","v":4},null,null,null,null,null,null,null,null,null,null,null,null,null,null,null,null,null,null,"الاسم","رقم الموظف","اللقب","الاسم واللقب"]
[{"$f":"Feuil3!A3","v":2},{"$f":"Tableau1[[#This Row],[رقم الحساب]]","v":1000},{"$f":"Feuil3!B3","v":"خالد"},{"$f":"Feuil3!C3","v":"اقتلقل"},{"$f":"Feuil3!D3","v":6},{"$f":"Feuil3!E3","v":"لاىتات"},{"$f":"Feuil3!F3","v":2},{"$f":"Feuil3!G3","v":"متزوج"},{"$f":"Feuil3!H3","v":12},{"$f":"Feuil3!I3","v":1000},1,2,3,4,5,6,7,8,9,10,11,12,13,14,null,null,null,null,15,16,17,18,null,null,null,null,null,"مارس",2016,null,{"$f":"A3","v":2},null,null,null,null,null,null,null,null,null,null,null,null,null,null,null,null,null,null,null,null,null,{"$f":"VLOOKUP(BL3,Feuil4!A2:C200,3,FALSE)","v":"شريف"},1,{"$f":"VLOOKUP(BL3,Feuil4!A2:D200,4,FALSE)","v":"عرابة"},{"$f":"Feuil4!BM3&\"  \"&Feuil4!BK3","v":"عرابة  شريف"}]
[3,{"$f":"Tableau1[[#This Row],[رقم الحساب]]","v":1230},{"$f":"Feuil3!B4","v":"تجريب"},{"$f":"Feuil3!C4","v":"البرنامج"},{"$f":"Feuil3!D4","v":12},{"$f":"Feuil3!E4","v":"استاذ"},{"$f":"Feuil3!F4","v":12},{"$f":"Feuil3!G4","v":"متزوج"},{"$f":"Feuil3!H4","v":2},{"$f":"Feuil3!I4","v":1230},12000,14000,16000,18000,20000,22000,24000,26000,28000,30000,32000,34000,36000,38000,null,null,null,null,40000,42000,44000,46000,48000,50000,52000,54000,56000,"جويلية",2017,"14/11/2013",3,null,null,null,null,null,null,null,null,null,null,null,null,null,null,null,null,null,null,2,1,4]
[{"$f":"Feuil3!A5","v":4},{"$f":"Tableau1[[#This Row],[رقم الحساب]]","v":0},{"$f":"Feuil3!B5","v":0},{"$f":"Feuil3!C5","v":0},{"$f":"Feuil3!D5","v":0},{"$f":"Feuil3!E5","v":0},{"$f":"Feuil3!F5","v":0},{"$f":"Feuil3!G5","v":0},{"$f":"Feuil3!H5","v":0},{"$f":"Feuil3!I5","v":0},null,null,null,null,null,null,null,null,null,null,null,null,null,null,null,null,null,null,null,null,null,null,null,null,null,null,null,"جانفي","Label30","2013-11-12",4]
[{"$f":"Feuil3!A6","v":0},{"$f":"Tableau1[[#This Row],[رقم الحساب]]","v":{"$error":"#VALUE!"}},{"$f":"Feuil3!B6","v":0},{"$f":"Feuil3!C6","v":0},{"$f":"Feuil3!D6","v":0},{"$f":"Feuil3!E6","v":0},{"$f":"Feuil3!F6","v":0},{"$f":"Feuil3!G6","v":0},{"$f":"Feuil3!H6","v":0},{"$f":"Feuil3!I6","v":0},1,2,3,null,5,6,7,8,9,10,11,12,13,14,null,null,null,null,null,null,null,null,null,null,null,null,null,null,"Label30","2013-01-11",0]
[{"$f":"Feuil3!A7","v":0},{"$f":"Tableau1[[#This Row],[رقم الحساب]]","v":{"$error":"#VALUE!"}},{"$f":"Feuil3!B7","v":0},{"$f":"Feuil3!C7","v":0},{"$f":"Feuil3!D7","v":0},{"$f":"Feuil3!E7","v":0},{"$f":"Feuil3!F7","v":0},{"$f":"Feuil3!G7","v":0},{"$f":"Feuil3!H7","v":0},{"$f":"Feuil3!I7","v":0},null,null,null,null,null,null,null,null,null,null,null,null,null,null,null,null,null,null,null,null,null,null,null,null,null,null,null,null,"Label30","2013-05-11",0]
[{"$f":"Feuil3!A8","v":0},{"$f":"Tableau1[[#This Row],[رقم الحساب]]","v":{"$error":"#VALUE!"}},{"$f":"Feuil3!B8","v":0},{"$f":"Feuil3!C8","v":0},{"$f":"Feuil3!D8","v":0},{"$f":"Feuil3!E8","v":0},{"$f":"Feuil3!F8","v":0},{"$f":"Feuil3!G8","v":0},{"$f":"Feuil3!H8","v":0},{"$f":"Feuil3!I8","v":0},null,null,null,null,null,null,null,null,null,null,null,null,null,null,null,null,null,null,null,null,null,null,null,null,null,null,null,null,"Label30","2013-05-11",0]
{"$rows_left_out":204}
{"sheet":"دخـــــــــــول","index":4,"n_rows":23,"n_cols":13,"rows_kept":23,"cut":false,"hidden":false,"merged":[[22,9,22,14],[4,0,6,9],[11,1,12,8],[17,3,17,6],[18,3,19,6],[10,11,10,15],[5,11,5,15],[6,11,6,15],[7,11,7,15],[8,11,8,15],[9,11,9,15],[17,9,17,14],[18,9,18,14],[19,9,19,14],[20,9,20,14],[21,9,21,14]]}
[]
[]
[]
[]
["GESTION DES PAIES"]
[null,null,null,null,null,null,null,null,null,null,null,"بسم الله الرحمان الرحيم"]
[null,null,null,null,null,null,null,null,null,null,null,"هذه النسخة التجريبية الاولى من برنامج تسيير كشف الراتب"]
[null,null,null,null,null,null,null,null,null,null,null,"version 1,00"]
{"$rows_left_out":16}
{"sheet":"Feuil6","index":5,"n_rows":38,"n_cols":6,"rows_kept":38,"cut":false,"hidden":false,"merged":[[5,10,5,13],[9,1,9,2],[9,5,9,6],[0,0,0,6],[1,0,1,6],[2,0,2,6],[3,0,3,6],[6,1,6,2],[6,5,6,6],[7,1,7,2],[7,5,7,6],[8,5,8,6],[4,0,4,6],[5,3,5,6],[5,0,5,2],[10,1,10,3],[10,5,10,6],[12,1,12,2],[12,5,12,6],[13,1,13,2],[13,5,13,6],[14,1,14,2],[14,5,14,6],[15,1,15,2],[15,5,15,6],[16,1,16,2],[16,5,16,6],[17,1,17,2],[17,5,17,6],[18,1,18,2],[18,5,18,6],[19,1,19,2],[19,5,19,6],[20,1,20,2],[20,5,20,6],[21,1,21,2],[21,5,21,6],[22,1,22,2],[22,5,22,6],[23,1,23,2],[23,5,23,6],[24,1,24,2],[24,5,24,6],[25,1,25,2],[25,5,25,6],[26,1,26,2],[26,5,26,6],[27,1,27,2],[27,5,27,6],[28,1,28,2],[28,5,28,6],[29,1,29,2],[29,5,29,6],[30,1,30,2],[30,5,30,6],[31,1,31,2],[31,5,31,6],[33,0,33,2],[33,4,33,6],[35,5,35,6],[37,1,37,2],[36,4,36,6]]}
[{"$f":"Feuil1!A1","v":"الجمهورية الجزائرية الديمقراطية الشعبية"}]
[{"$f":"Feuil1!A2","v":"وزارة التربية الوطنية "}]
[{"$f":"Feuil1!A3","v":"مديرية التربية "}]
[{"$f":"Feuil1!A4","v":"مديرية التربية "}]
[{"$f":"Feuil1!A5","v":"كشف الراتب لشهر:"}]
[{"$f":"Feuil1!A6","v":2014},null,null,{"$f":"Feuil1!D6","v":"فيفري"}]
[{"$f":"Feuil1!A7","v":"أعزب"},"الحالة العائلية",null,null,{"$f":"Feuil1!E7","v":"شريف"},"الاســـــــــــــــــم"]
[{"$f":"Feuil1!A8","v":12},"الدرجـــــــــة",null,null,{"$f":"Feuil1!E8","v":"عرابة"},"اللقــــــــــــــــــب"]
{"$rows_left_out":31}
{"sheet":"Feuil7","index":6,"n_rows":19,"n_cols":10,"rows_kept":19,"cut":false,"hidden":false,"merged":[]}
["الرقم","المنحة",null,"الرقم","الاقتطاع",null,{"$f":"Feuil2!G1","v":"المؤسسة"},{"$f":"Feuil2!H1","v":"الجهة الوصية"},{"$f":"Feuil2!I1","v":"المقتصد"},{"$f":"Feuil2!J1","v":"الوزارة"}]
[{"$f":"Feuil2!A2","v":1},{"$f":"Feuil2!B2","v":"ujujuj"},null,{"$f":"Feuil2!D2","v":1},{"$f":"Feuil2!E2","v":"yynynynyn"},null,{"$f":"Feuil2!G2","v":"مديرية التربية "},{"$f":"Feuil2!H2","v":"مديرية التربية "},{"$f":"Feuil2!I2","v":"عرابة شريف"},{"$f":"Feuil2!J2","v":"وزارة التربية الوطنية "}]
[{"$f":"Feuil2!A3","v":2},{"$f":"Feuil2!B3","v":"uj-uju-j"},null,{"$f":"Feuil2!D3","v":2},{"$f":"Feuil2!E3","v":"nununu"}]
[{"$f":"Feuil2!A4","v":3},{"$f":"Feuil2!B4","v":"-jrtgth"},null,{"$f":"Feuil2!D4","v":3},{"$f":"Feuil2!E4","v":0},null,{"$f":"Feuil2!G12","v":4},{"$f":"Feuil2!H12","v":3}]
[{"$f":"Feuil2!A5","v":4},{"$f":"Feuil2!B5","v":0},null,{"$f":"Feuil2!D5","v":0},{"$f":"Feuil2!E5","v":0}]
[{"$f":"Feuil2!A6","v":0},{"$f":"Feuil2!B6","v":0},null,{"$f":"Feuil2!D6","v":0},{"$f":"Feuil2!E6","v":0}]
[{"$f":"Feuil2!A7","v":0},{"$f":"Feuil2!B7","v":0},null,{"$f":"Feuil2!D7","v":0},{"$f":"Feuil2!E7","v":0}]
[{"$f":"Feuil2!A8","v":0},{"$f":"Feuil2!B8","v":0},null,{"$f":"Feuil2!D8","v":0},{"$f":"Feuil2!E8","v":0}]
{"$rows_left_out":12}
{"sheet":"Feuil8","index":7,"n_rows":200,"n_cols":9,"rows_kept":200,"cut":false,"hidden":false,"merged":[]}
["الرقم","الاسم","اللقب","الصنف","الاطار","القسم","الحالة العائلية","الدرجة","رقم الحساب"]
[{"$f":"Tableau1[[#This Row],[الرقم]]","v":1},{"$f":"Tableau1[[#This Row],[الاسم]]","v":"شريف"},{"$f":"Tableau1[[#This Row],[اللقب]]","v":"عرابة"},{"$f":"Tableau1[[#This Row],[الصنف]]","v":13},{"$f":"Tableau1[[#This Row],[الاطار]]","v":"طب"},{"$f":"Tableau1[[#This Row],[القسم]]","v":14},{"$f":"Tableau1[[#This Row],[الحالة العائلية]]","v":"أعزب"},{"$f":"Tableau1[[#This Row],[الدرجة]]","v":12},{"$f":"Tableau1[[#This Row],[رقم الحساب]]","v":1020}]
[{"$f":"Tableau1[[#This Row],[الرقم]]","v":2},{"$f":"Tableau1[[#This Row],[الاسم]]","v":"خالد"},{"$f":"Tableau1[[#This Row],[اللقب]]","v":"اقتلقل"},{"$f":"Tableau1[[#This Row],[الصنف]]","v":6},{"$f":"Tableau1[[#This Row],[الاطار]]","v":"لاىتات"},{"$f":"Tableau1[[#This Row],[القسم]]","v":2},{"$f":"Tableau1[[#This Row],[الحالة العائلية]]","v":"متزوج"},{"$f":"Tableau1[[#This Row],[الدرجة]]","v":12},{"$f":"Tableau1[[#This Row],[رقم الحساب]]","v":1000}]
[{"$f":"Tableau1[[#This Row],[الرقم]]","v":3},{"$f":"Tableau1[[#This Row],[الاسم]]","v":"تجريب"},{"$f":"Tableau1[[#This Row],[اللقب]]","v":"البرنامج"},{"$f":"Tableau1[[#This Row],[الصنف]]","v":12},{"$f":"Tableau1[[#This Row],[الاطار]]","v":"استاذ"},{"$f":"Tableau1[[#This Row],[القسم]]","v":12},{"$f":"Tableau1[[#This Row],[الحالة العائلية]]","v":"متزوج"},{"$f":"Tableau1[[#This Row],[الدرجة]]","v":2},{"$f":"Tableau1[[#This Row],[رقم الحساب]]","v":1230}]
[{"$f":"Tableau1[[#This Row],[الرقم]]","v":4},{"$f":"Tableau1[[#This Row],[الاسم]]","v":0},{"$f":"Tableau1[[#This Row],[اللقب]]","v":0},{"$f":"Tableau1[[#This Row],[الصنف]]","v":0},{"$f":"Tableau1[[#This Row],[الاطار]]","v":0},{"$f":"Tableau1[[#This Row],[القسم]]","v":0},{"$f":"Tableau1[[#This Row],[الحالة العائلية]]","v":0},{"$f":"Tableau1[[#This Row],[الدرجة]]","v":0},{"$f":"Tableau1[[#This Row],[رقم الحساب]]","v":0}]
[{"$f":"Tableau1[[#This Row],[الرقم]]","v":{"$error":"#VALUE!"}},{"$f":"Tableau1[[#This Row],[الاسم]]","v":{"$error":"#VALUE!"}},{"$f":"Tableau1[[#This Row],[اللقب]]","v":{"$error":"#VALUE!"}},{"$f":"Tableau1[[#This Row],[الصنف]]","v":{"$error":"#VALUE!"}},{"$f":"Tableau1[[#This Row],[الاطار]]","v":{"$error":"#VALUE!"}},{"$f":"Tableau1[[#This Row],[القسم]]","v":{"$error":"#VALUE!"}},{"$f":"Tableau1[[#This Row],[الحالة العائلية]]","v":{"$error":"#VALUE!"}},{"$f":"Tableau1[[#This Row],[الدرجة]]","v":{"$error":"#VALUE!"}},{"$f":"Tableau1[[#This Row],[رقم الحساب]]","v":{"$error":"#VALUE!"}}]
[{"$f":"Tableau1[[#This Row],[الرقم]]","v":{"$error":"#VALUE!"}},{"$f":"Tableau1[[#This Row],[الاسم]]","v":{"$error":"#VALUE!"}},{"$f":"Tableau1[[#This Row],[اللقب]]","v":{"$error":"#VALUE!"}},{"$f":"Tableau1[[#This Row],[الصنف]]","v":{"$error":"#VALUE!"}},{"$f":"Tableau1[[#This Row],[الاطار]]","v":{"$error":"#VALUE!"}},{"$f":"Tableau1[[#This Row],[القسم]]","v":{"$error":"#VALUE!"}},{"$f":"Tableau1[[#This Row],[الحالة العائلية]]","v":{"$error":"#VALUE!"}},{"$f":"Tableau1[[#This Row],[الدرجة]]","v":{"$error":"#VALUE!"}},{"$f":"Tableau1[[#This Row],[رقم الحساب]]","v":{"$error":"#VALUE!"}}]
[{"$f":"Tableau1[[#This Row],[الرقم]]","v":{"$error":"#VALUE!"}},{"$f":"Tableau1[[#This Row],[الاسم]]","v":{"$error":"#VALUE!"}},{"$f":"Tableau1[[#This Row],[اللقب]]","v":{"$error":"#VALUE!"}},{"$f":"Tableau1[[#This Row],[الصنف]]","v":{"$error":"#VALUE!"}},{"$f":"Tableau1[[#This Row],[الاطار]]","v":{"$error":"#VALUE!"}},{"$f":"Tableau1[[#This Row],[القسم]]","v":{"$error":"#VALUE!"}},{"$f":"Tableau1[[#This Row],[الحالة العائلية]]","v":{"$error":"#VALUE!"}},{"$f":"Tableau1[[#This Row],[الدرجة]]","v":{"$error":"#VALUE!"}},{"$f":"Tableau1[[#This Row],[رقم الحساب]]","v":{"$error":"#VALUE!"}}]
{"$rows_left_out":193}
{"sheet":"Feuil9","index":8,"n_rows":210,"n_cols":61,"rows_kept":210,"cut":false,"hidden":false,"merged":[]}
["الرقم","رقم الحساب",{"$f":"Feuil3!B1","v":"الاسم"},{"$f":"Feuil3!C1","v":"اللقب"},{"$f":"Feuil3!D1","v":"الصنف"},{"$f":"Feuil3!E1","v":"الاطار"},{"$f":"Feuil3!F1","v":"القسم"},{"$f":"Feuil3!G1","v":"الحالة العائلية"},{"$f":"Feuil3!H1","v":"الدرجة"},{"$f":"Feuil3!I1","v":"رقم الحساب"},{"$f":"Feuil2!B2","v":"ujujuj"},{"$f":"Feuil2!B3","v":"uj-uju-j"},{"$f":"Feuil2!B4","v":"-jrtgth"},{"$f":"Feuil2!B5","v":0},{"$f":"Feuil2!B6","v":0},{"$f":"Feuil2!B7","v":0},{"$f":"Feuil2!B14","v":0},{"$f":"Feuil2!B15","v":0},{"$f":"Feuil2!B16","v":0},{"$f":"Feuil2!B17","v":0},{"$f":"Feuil2!B24","v":0},{"$f":"Feuil2!B25","v":0},{"$f":"Feuil2!B26","v":0},{"$f":"Feuil2!B28","v":0},{"$f":"Feuil2!B29","v":0},{"$f":"Feuil2!B30","v":0},{"$f":"Feuil2!B31","v":0},{"$f":"Feuil2!B32","v":0},{"$f":"Feuil2!E2","v":"yynynynyn"},{"$f":"Feuil2!E3","v":"nununu"},{"$f":"Feuil2!E17","v":0},{"$f":"Feuil2!E18","v":0},{"$f":"Feuil2!E19","v":0},{"$f":"Feuil2!E20","v":0},{"$f":"Feuil2!E21","v":0},{"$f":"Feuil2!E22","v":0},{"$f":"Feuil2!E23","v":0},"الشهر","السنة","التاريخ",{"$f":"Feuil4!AO1","v":"رقم الموظف المدخل"},{"$f":"Feuil4!AP1","v":"val_resul"},{"$f":"Feuil4!AQ1","v":"val_cher"}]
[{"$f":"Feuil4!A2","v":1},{"$f":"Feuil4!B2","v":1020},{"$f":"Feuil4!C2","v":"شريف"},{"$f":"Feuil4!D2","v":"عرابة"},{"$f":"Feuil4!E2","v":13},{"$f":"Feuil4!F2","v":"طب"},{"$f":"Feuil4!G2","v":14},{"$f":"Feuil4!H2","v":"أعزب"},{"$f":"Feuil4!I2","v":12},{"$f":"Feuil4!J2","v":1020},{"$f":"Feuil4!K2","v":12000},{"$f":"Feuil4!L2","v":20000},{"$f":"Feuil4!M2","v":25000},{"$f":"Feuil4!N2","v":0},{"$f":"Feuil4!O2","v":0},{"$f":"Feuil4!P2","v":0},{"$f":"Feuil4!Q2","v":0},{"$f":"Feuil4!R2","v":0},{"$f":"Feuil4!S2","v":0},{"$f":"Feuil4!T2","v":0},{"$f":"Feuil4!U2","v":30000},{"$f":"Feuil4!V2","v":40000},{"$f":"Feuil4!W2","v":30000},{"$f":"Feuil4!X2","v":30000},{"$f":"Feuil4!Y2","v":0},{"$f":"Feuil4!Z2","v":0},{"$f":"Feuil4!AA2","v":0},{"$f":"Feuil4!AB2","v":0},{"$f":"Feuil4!AC2","v":1000},{"$f":"Feuil4!AD2","v":2000},{"$f":"Feuil4!AE2","v":0},{"$f":"Feuil4!AF2","v":0},{"$f":"Feuil4!AG2","v":0},{"$f":"Feuil4!AH2","v":0},{"$f":"Feuil4!AI2","v":0},{"$f":"Feuil4!AJ2","v":0},{"$f":"Feuil4!AK2","v":0},{"$f":"Feuil4!AL2","v":"فيفري"},{"$f":"Feuil4!AM2","v":2014},{"$f":"Feuil4!AN2","v":"2013-01-11"},{"$f":"Feuil4!AO2","v":1},{"$f":"Feuil4!AP2","v":4},{"$f":"Feuil4!AQ2","v":0}]
[{"$f":"Feuil4!A3","v":2},{"$f":"Feuil4!B3","v":1000},{"$f":"Feuil4!C3","v":"خالد"},{"$f":"Feuil4!D3","v":"اقتلقل"},{"$f":"Feuil4!E3","v":6},{"$f":"Feuil4!F3","v":"لاىتات"},{"$f":"Feuil4!G3","v":2},{"$f":"Feuil4!H3","v":"متزوج"},{"$f":"Feuil4!I3","v":12},{"$f":"Feuil4!J3","v":1000},{"$f":"Feuil4!K3","v":1},{"$f":"Feuil4!L3","v":2},{"$f":"Feuil4!M3","v":3},{"$f":"Feuil4!N3","v":4},{"$f":"Feuil4!O3","v":5},{"$f":"Feuil4!P3","v":6},{"$f":"Feuil4!Q3","v":7},{"$f":"Feuil4!R3","v":8},{"$f":"Feuil4!S3","v":9},{"$f":"Feuil4!T3","v":10},{"$f":"Feuil4!U3","v":11},{"$f":"Feuil4!V3","v":12},{"$f":"Feuil4!W3","v":13},{"$f":"Feuil4!X3","v":14},{"$f":"Feuil4!Y3","v":0},{"$f":"Feuil4!Z3","v":0},{"$f":"Feuil4!AA3","v":0},{"$f":"Feuil4!AB3","v":0},{"$f":"Feuil4!AC3","v":15},{"$f":"Feuil4!AD3","v":16},{"$f":"Feuil4!AE3","v":17},{"$f":"Feuil4!AF3","v":18},{"$f":"Feuil4!AG3","v":0},{"$f":"Feuil4!AH3","v":0},{"$f":"Feuil4!AI3","v":0},{"$f":"Feuil4!AJ3","v":0},{"$f":"Feuil4!AK3","v":0},{"$f":"Feuil4!AL3","v":"مارس"},{"$f":"Feuil4!AM3","v":2016},{"$f":"Feuil4!AN3","v":"00:00:00"},{"$f":"Feuil4!AO3","v":2}]
[{"$f":"Feuil4!A4","v":3},{"$f":"Feuil4!B4","v":1230},{"$f":"Feuil4!C4","v":"تجريب"},{"$f":"Feuil4!D4","v":"البرنامج"},{"$f":"Feuil4!E4","v":12},{"$f":"Feuil4!F4","v":"استاذ"},{"$f":"Feuil4!G4","v":12},{"$f":"Feuil4!H4","v":"متزوج"},{"$f":"Feuil4!I4","v":2},{"$f":"Feuil4!J4","v":1230},{"$f":"Feuil4!K4","v":12000},{"$f":"Feuil4!L4","v":14000},{"$f":"Feuil4!M4","v":16000},{"$f":"Feuil4!N4","v":18000},{"$f":"Feuil4!O4","v":20000},{"$f":"Feuil4!P4","v":22000},{"$f":"Feuil4!Q4","v":24000},{"$f":"Feuil4!R4","v":26000},{"$f":"Feuil4!S4","v":28000},{"$f":"Feuil4!T4","v":30000},{"$f":"Feuil4!U4","v":32000},{"$f":"Feuil4!V4","v":34000},{"$f":"Feuil4!W4","v":36000},{"$f":"Feuil4!X4","v":38000},{"$f":"Feuil4!Y4","v":0},{"$f":"Feuil4!Z4","v":0},{"$f":"Feuil4!AA4","v":0},{"$f":"Feuil4!AB4","v":0},{"$f":"Feuil4!AC4","v":40000},{"$f":"Feuil4!AD4","v":42000},{"$f":"Feuil4!AE4","v":44000},{"$f":"Feuil4!AF4","v":46000},{"$f":"Feuil4!AG4","v":48000},{"$f":"Feuil4!AH4","v":50000},{"$f":"Feuil4!AI4","v":52000},{"$f":"Feuil4!AJ4","v":54000},{"$f":"Feuil4!AK4","v":56000},{"$f":"Feuil4!AL4","v":"جويلية"},{"$f":"Feuil4!AM4","v":2017},{"$f":"Feuil4!AN4","v":"14/11/2013"},{"$f":"Feuil4!AO4","v":3},null,null,null,null,null,null,null,null,null,null,null,null,null,null,null,null,null,null,null,2]
[{"$f":"Feuil4!A5","v":4},{"$f":"Feuil4!B5","v":0},{"$f":"Feuil4!C5","v":0},{"$f":"Feuil4!D5","v":0},{"$f":"Feuil4!E5","v":0},{"$f":"Feuil4!F5","v":0},{"$f":"Feuil4!G5","v":0},{"$f":"Feuil4!H5","v":0},{"$f":"Feuil4!I5","v":0},{"$f":"Feuil4!J5","v":0},{"$f":"Feuil4!K5","v":0},{"$f":"Feuil4!L5","v":0},{"$f":"Feuil4!M5","v":0},{"$f":"Feuil4!N5","v":0},{"$f":"Feuil4!O5","v":0},{"$f":"Feuil4!P5","v":0},{"$f":"Feuil4!Q5","v":0},{"$f":"Feuil4!R5","v":0},{"$f":"Feuil4!S5","v":0},{"$f":"Feuil4!T5","v":0},{"$f":"Feuil4!U5","v":0},{"$f":"Feuil4!V5","v":0},{"$f":"Feuil4!W5","v":0},{"$f":"Feuil4!X5","v":0},{"$f":"Feuil4!Y5","v":0},{"$f":"Feuil4!Z5","v":0},{"$f":"Feuil4!AA5","v":0},{"$f":"Feuil4!AB5","v":0},{"$f":"Feuil4!AC5","v":0},{"$f":"Feuil4!AD5","v":0},{"$f":"Feuil4!AE5","v":0},{"$f":"Feuil4!AF5","v":0},{"$f":"Feuil4!AG5","v":0},{"$f":"Feuil4!AH5","v":0},{"$f":"Feuil4!AI5","v":0},{"$f":"Feuil4!AJ5","v":0},{"$f":"Feuil4!AK5","v":0},{"$f":"Feuil4!AL5","v":"جانفي"},{"$f":"Feuil4!AM5","v":"Label30"},{"$f":"Feuil4!AN5","v":"2013-11-12"},{"$f":"Feuil4!AO5","v":4}]
[{"$f":"Feuil4!A6","v":0},{"$f":"Feuil4!B6","v":{"$error":"#VALUE!"}},{"$f":"Feuil4!C6","v":0},{"$f":"Feuil4!D6","v":0},{"$f":"Feuil4!E6","v":0},{"$f":"Feuil4!F6","v":0},{"$f":"Feuil4!G6","v":0},{"$f":"Feuil4!H6","v":0},{"$f":"Feuil4!I6","v":0},{"$f":"Feuil4!J6","v":0},{"$f":"Feuil4!K6","v":1},{"$f":"Feuil4!L6","v":2},{"$f":"Feuil4!M6","v":3},{"$f":"Feuil4!N6","v":0},{"$f":"Feuil4!O6","v":5},{"$f":"Feuil4!P6","v":6},{"$f":"Feuil4!Q6","v":7},{"$f":"Feuil4!R6","v":8},{"$f":"Feuil4!S6","v":9},{"$f":"Feuil4!T6","v":10},{"$f":"Feuil4!U6","v":11},{"$f":"Feuil4!V6","v":12},{"$f":"Feuil4!W6","v":13},{"$f":"Feuil4!X6","v":14},{"$f":"Feuil4!Y6","v":0},{"$f":"Feuil4!Z6","v":0},{"$f":"Feuil4!AA6","v":0},{"$f":"Feuil4!AB6","v":0},{"$f":"Feuil4!AC6","v":0},{"$f":"Feuil4!AD6","v":0},{"$f":"Feuil4!AE6","v":0},{"$f":"Feuil4!AF6","v":0},{"$f":"Feuil4!AG6","v":0},{"$f":"Feuil4!AH6","v":0},{"$f":"Feuil4!AI6","v":0},{"$f":"Feuil4!AJ6","v":0},{"$f":"Feuil4!AK6","v":0},{"$f":"Feuil4!AL6","v":0},{"$f":"Feuil4!AM6","v":"Label30"},{"$f":"Feuil4!AN6","v":"2013-01-11"},{"$f":"Feuil4!AO6","v":0}]
[{"$f":"Feuil4!A7","v":0},{"$f":"Feuil4!B7","v":{"$error":"#VALUE!"}},{"$f":"Feuil4!C7","v":0},{"$f":"Feuil4!D7","v":0},{"$f":"Feuil4!E7","v":0},{"$f":"Feuil4!F7","v":0},{"$f":"Feuil4!G7","v":0},{"$f":"Feuil4!H7","v":0},{"$f":"Feuil4!I7","v":0},{"$f":"Feuil4!J7","v":0},{"$f":"Feuil4!K7","v":0},{"$f":"Feuil4!L7","v":0},{"$f":"Feuil4!M7","v":0},{"$f":"Feuil4!N7","v":0},{"$f":"Feuil4!O7","v":0},{"$f":"Feuil4!P7","v":0},{"$f":"Feuil4!Q7","v":0},{"$f":"Feuil4!R7","v":0},{"$f":"Feuil4!S7","v":0},{"$f":"Feuil4!T7","v":0},{"$f":"Feuil4!U7","v":0},{"$f":"Feuil4!V7","v":0},{"$f":"Feuil4!W7","v":0},{"$f":"Feuil4!X7","v":0},{"$f":"Feuil4!Y7","v":0},{"$f":"Feuil4!Z7","v":0},{"$f":"Feuil4!AA7","v":0},{"$f":"Feuil4!AB7","v":0},{"$f":"Feuil4!AC7","v":0},{"$f":"Feuil4!AD7","v":0},{"$f":"Feuil4!AE7","v":0},{"$f":"Feuil4!AF7","v":0},{"$f":"Feuil4!AG7","v":0},{"$f":"Feuil4!AH7","v":0},{"$f":"Feuil4!AI7","v":0},{"$f":"Feuil4!AJ7","v":0},{"$f":"Feuil4!AK7","v":0},{"$f":"Feuil4!AL7","v":0},{"$f":"Feuil4!AM7","v":"Label30"},{"$f":"Feuil4!AN7","v":"2013-05-11"},{"$f":"Feuil4!AO7","v":0}]
[{"$f":"Feuil4!A8","v":0},{"$f":"Feuil4!B8","v":{"$error":"#VALUE!"}},{"$f":"Feuil4!C8","v":0},{"$f":"Feuil4!D8","v":0},{"$f":"Feuil4!E8","v":0},{"$f":"Feuil4!F8","v":0},{"$f":"Feuil4!G8","v":0},{"$f":"Feuil4!H8","v":0},{"$f":"Feuil4!I8","v":0},{"$f":"Feuil4!J8","v":0},{"$f":"Feuil4!K8","v":0},{"$f":"Feuil4!L8","v":0},{"$f":"Feuil4!M8","v":0},{"$f":"Feuil4!N8","v":0},{"$f":"Feuil4!O8","v":0},{"$f":"Feuil4!P8","v":0},{"$f":"Feuil4!Q8","v":0},{"$f":"Feuil4!R8","v":0},{"$f":"Feuil4!S8","v":0},{"$f":"Feuil4!T8","v":0},{"$f":"Feuil4!U8","v":0},{"$f":"Feuil4!V8","v":0},{"$f":"Feuil4!W8","v":0},{"$f":"Feuil4!X8","v":0},{"$f":"Feuil4!Y8","v":0},{"$f":"Feuil4!Z8","v":0},{"$f":"Feuil4!AA8","v":0},{"$f":"Feuil4!AB8","v":0},{"$f":"Feuil4!AC8","v":0},{"$f":"Feuil4!AD8","v":0},{"$f":"Feuil4!AE8","v":0},{"$f":"Feuil4!AF8","v":0},{"$f":"Feuil4!AG8","v":0},{"$f":"Feuil4!AH8","v":0},{"$f":"Feuil4!AI8","v":0},{"$f":"Feuil4!AJ8","v":0},{"$f":"Feuil4!AK8","v":0},{"$f":"Feuil4!AL8","v":0},{"$f":"Feuil4!AM8","v":"Label30"},{"$f":"Feuil4!AN8","v":"2013-05-11"},{"$f":"Feuil4!AO8","v":0}]
{"$rows_left_out":202}